Target
D(3) dopamine receptor
Ligand
BDBM50261383
Substrate
Meas. Tech.
ChEMBL_532729 (CHEMBL971392)
EC50
0.085±n/a nM
Citation
 Biswas, SHazeldine, SGhosh, BParrington, IKuzhikandathil, EReith, MEDutta, AK Bioisosteric heterocyclic versions of 7-{[2-(4-phenyl-piperazin-1-yl)ethyl]propylamino}-5,6,7,8-tetrahydronaphthalen-2-ol: identification of highly potent and selective agonists for dopamine D3 receptor with potent in vivo activity. J Med Chem 51:3005-19 (2008)  
Target
Name:
D(3) dopamine receptor
Synonyms:
DOPAMINE D3 DRD3_HUMAN Dopamine D3 receptor (D3) Dopamine receptor Dopamine receptor D3
Type:
Mol. Mass.:
44243.43
Organism:
Homo sapiens (Human)
Description:
Residue:
400
  
Inhibitor
Name:
BDBM50261383
Synonyms:
(-)-N6-(2-(4-(Biphenyl-4-yl)piperazin-1-yl)-ethyl)-N6-propyl-4,5,6,7-tetrahydrobenzo[d]thiazole-2,6-diamine | CHEMBL467540
Type:
Small organic molecule
Emp. Form.:
C28H37N5S
Mol. Mass.:
475.692
SMILES:
CCCN(CCN1CCN(CC1)c1ccc(cc1)-c1ccccc1)C1CCc2nc(N)sc2C1
: