Target
Melanocortin receptor 5
Ligand
BDBM50261197
Substrate
Meas. Tech.
ChEMBL_555531 (CHEMBL963791)
Ki
110±n/a nM
Citation
 Chen, CTucci, FCJiang, WTran, JAFleck, BAHoare, SRWen, JChen, TJohns, MMarkison, SFoster, ACMarinkovic, DChen, CWArellano, MHarman, JSaunders, JBozigian, HMarks, D Pharmacological and pharmacokinetic characterization of 2-piperazine-alpha-isopropyl benzylamine derivatives as melanocortin-4 receptor antagonists. Bioorg Med Chem 16:5606-18 (2008)  
Target
Name:
Melanocortin receptor 5
Synonyms:
MC-2 MC5R Melanocortin MC5 Melanocortin receptor 5 | Melanocortin receptor 5 (MC5R)
Type:
Enzyme
Mol. Mass.:
36612.92
Organism:
Homo sapiens (Human)
Description:
P33032
Residue:
325
  
Inhibitor
Name:
BDBM50261197
Synonyms:
1-{2-[(1S)-(Methylaminoacetamido)-2-methylpropyl]-4-chlorophenyl}-4-[(2R)-methyl-3-(4-chlorophenyl)propionyl]piperazine | CHEMBL525177
Type:
Small organic molecule
Emp. Form.:
C27H36Cl2N4O2
Mol. Mass.:
519.506
SMILES:
CNCC(=O)N[C@@H](C(C)C)c1cc(Cl)ccc1N1CCN(CC1)C(=O)[C@H](C)Cc1ccc(Cl)cc1
: