Target
Gonadotropin-releasing hormone receptor
Ligand
BDBM50067485
Substrate
Meas. Tech.
ChEMBL_555922 (CHEMBL956658)
IC50
0.2±n/a nM
Citation
 Betz, SFZhu, YFChen, CStruthers, RS Non-peptide gonadotropin-releasing hormone receptor antagonists. J Med Chem 51:3331-48 (2008)  
Target
Name:
Gonadotropin-releasing hormone receptor
Synonyms:
GNRHR GRHR GnRH-R Gonadotropin-releasing hormone receptor | Gonadotropin-releasing hormone receptor (GnRH)
Type:
Enzyme
Mol. Mass.:
37749.45
Organism:
Homo sapiens (Human)
Description:
P30968
Residue:
328
  
Inhibitor
Name:
BDBM50067485
Synonyms:
3-[(Benzyl-methyl-amino)-methyl]-7-(2,6-difluoro-benzyl)-2-(4-isobutyrylamino-phenyl)-4-oxo-4,7-dihydro-thieno[2,3-b]pyridine-5-carboxylic acid isopropyl ester; hydrochloride CHEMBL71917 | T-98475
Type:
Small organic molecule
Emp. Form.:
C37H37F2N3O4S
Mol. Mass.:
657.769
SMILES:
CC(C)OC(=O)c1cn(Cc2c(F)cccc2F)c2sc(c(CN(C)Cc3ccccc3)c2c1=O)-c1ccc(NC(=O)C(C)C)cc1
: