Target
Tyrosine-protein phosphatase non-receptor type 1
Ligand
BDBM50266161
Substrate
Meas. Tech.
ChEMBL_544687 (CHEMBL1009264)
IC50
1900±n/a nM
Citation
 Kumar, AAhmad, PMaurya, RASingh, ABSrivastava, AK Novel 2-aryl-naphtho[1,2-d]oxazole derivatives as potential PTP-1B inhibitors showing antihyperglycemic activities. Eur J Med Chem 44:109-16 (2008)  
Target
Name:
Tyrosine-protein phosphatase non-receptor type 1
Synonyms:
PTN1_HUMAN PTPN1 Protein tyrosine phosphatase-1B (PTP1B) Protein-tyrosine phosphatase 1B (PTP1B) Tyrosine-protein phosphatase non-receptor type 1 (PTP1B)
Type:
Protein phosphatase
Mol. Mass.:
49963.76
Organism:
Homo sapiens (Human)
Description:
Human recombinant GST-fusion PTP1B (1-435).
Residue:
435
  
Inhibitor
Name:
BDBM50266161
Synonyms:
2-[4-(2-Piperidine-1-yl-ethoxy)-phenyl]-naphtho[1,2-d]oxazole | CHEMBL467572
Type:
Small organic molecule
Emp. Form.:
C24H24N2O2
Mol. Mass.:
372.4596
SMILES:
C(CN1CCCCC1)Oc1ccc(cc1)-c1nc2c(ccc3ccccc23)o1
: