Target
11-beta-hydroxysteroid dehydrogenase 1
Ligand
BDBM50260747
Substrate
Meas. Tech.
ChEMBL_552255 (CHEMBL995585)
IC50
8.2±n/a nM
Citation
 Zhu, YOlson, SHHermanowski-Vosatka, AMundt, SShah, KSpringer, MThieringer, RWright, SXiao, JZokian, HBalkovec, JM 4-Methyl-5-phenyl triazoles as selective inhibitors of 11beta-hydroxysteroid dehydrogenase type I. Bioorg Med Chem Lett 18:3405-11 (2008)  
Target
Name:
11-beta-hydroxysteroid dehydrogenase 1
Synonyms:
11-DH 11-beta-Hydroxysteroid Dehydrogenase 1 (11-beta-HSD1) 11beta-HSD1A Corticosteroid 11-beta-dehydrogenase isozyme 1 (11-beta-HSD-1) Hsd11 | Hsd11b1
Type:
Enzyme
Mol. Mass.:
32369.70
Organism:
Mus musculus (mouse)
Description:
P50172
Residue:
292
  
Inhibitor
Name:
BDBM50260747
Synonyms:
3-(1-(4-chlorophenyl)cyclobutyl)-5-(4-iodophenyl)-4-methyl-4H-1,2,4-triazole | CHEMBL498351
Type:
Small organic molecule
Emp. Form.:
C19H17ClIN3
Mol. Mass.:
449.716
SMILES:
Cn1c(nnc1C1(CCC1)c1ccc(Cl)cc1)-c1ccc(I)cc1
: