Target
Kappa-type opioid receptor
Ligand
BDBM29995
Substrate
Meas. Tech.
ChEMBL_556069 (CHEMBL953422)
IC50
120±n/a nM
Citation
 Okamoto, OKobayashi, KKawamoto, HIto, SYoshizumi, TYamamoto, IHashimoto, MShimizu, ATakahashi, HIshii, YOzaki, SOhta, H Novel ORL1-selective antagonists with oral bioavailability and brain penetrability. Bioorg Med Chem Lett 18:3282-5 (2008)  
Target
Name:
Kappa-type opioid receptor
Synonyms:
K-OR-1 Kappa-opioid receptor (KOR) Kappa-type opioid receptor (KOR) OPIATE Kappa OPRK1 kappa opioid receptor (KOR)
Type:
G Protein-Coupled Receptor (GPCR)
Mol. Mass.:
42648.76
Organism:
Homo sapiens (Human)
Description:
P41145
Residue:
380
  
Inhibitor
Name:
BDBM29995
Synonyms:
CHEMBL494350 | benzimidazole-based antagonist, 1
Type:
Small organic molecule
Emp. Form.:
C18H27ClN4OS
Mol. Mass.:
382.951
SMILES:
C[C@@H]1CN(CCO)CCN1c1cc2[nH]c(SC(C)(C)C)nc2cc1Cl
: