Target
D-aspartate oxidase
Ligand
BDBM31147
Substrate
Meas. Tech.
ChEMBL_556667 (CHEMBL958954)
IC50
>5000±n/a nM
Citation
 Sparey, TAbeywickrema, PAlmond, SBrandon, NByrne, NCampbell, AHutson, PHJacobson, MJones, BMunshi, SPascarella, DPike, APrasad, GSSachs, NSakatis, MSardana, VVenkatraman, SYoung, MB The discovery of fused pyrrole carboxylic acids as novel, potent D-amino acid oxidase (DAO) inhibitors. Bioorg Med Chem Lett 18:3386-91 (2008)  
Target
Name:
D-aspartate oxidase
Synonyms:
D-Aspartate Oxidase (DDO) DDO | OXDD_HUMAN
Type:
Oxidoreductase
Mol. Mass.:
37543.06
Organism:
Homo sapiens (Human)
Description:
Recombinant human DDO expressed and purified from sf9 insect cells, was used in enzyme assays.
Residue:
341
  
Inhibitor
Name:
BDBM31147
Synonyms:
4H-furo[3,2-b]pyrrole-5-carboxylic acid CHEMBL492591
Type:
Small organic molecule
Emp. Form.:
C7H5NO3
Mol. Mass.:
151.1195
SMILES:
OC(=O)c1cc2occc2[nH]1
: