Target
D-aspartate oxidase
Ligand
BDBM50260722
Substrate
Meas. Tech.
ChEMBL_556667 (CHEMBL958954)
IC50
>5000±n/a nM
Citation
 Sparey, TAbeywickrema, PAlmond, SBrandon, NByrne, NCampbell, AHutson, PHJacobson, MJones, BMunshi, SPascarella, DPike, APrasad, GSSachs, NSakatis, MSardana, VVenkatraman, SYoung, MB The discovery of fused pyrrole carboxylic acids as novel, potent D-amino acid oxidase (DAO) inhibitors. Bioorg Med Chem Lett 18:3386-91 (2008)  
Target
Name:
D-aspartate oxidase
Synonyms:
D-Aspartate Oxidase (DDO) DDO | OXDD_HUMAN
Type:
Oxidoreductase
Mol. Mass.:
37543.06
Organism:
Homo sapiens (Human)
Description:
Recombinant human DDO expressed and purified from sf9 insect cells, was used in enzyme assays.
Residue:
341
  
Inhibitor
Name:
BDBM50260722
Synonyms:
4-(4-chlorophenethyl)-1H-pyrrole-2-carboxylic acid | CHEMBL453239
Type:
Small organic molecule
Emp. Form.:
C13H12ClNO2
Mol. Mass.:
249.693
SMILES:
OC(=O)c1cc(CCc2ccc(Cl)cc2)c[nH]1
: