Target
D-amino-acid oxidase
Ligand
BDBM50260769
Substrate
Meas. Tech.
ChEMBL_556666 (CHEMBL958953)
IC50
>5000±n/a nM
Citation
 Sparey, TAbeywickrema, PAlmond, SBrandon, NByrne, NCampbell, AHutson, PHJacobson, MJones, BMunshi, SPascarella, DPike, APrasad, GSSachs, NSakatis, MSardana, VVenkatraman, SYoung, MB The discovery of fused pyrrole carboxylic acids as novel, potent D-amino acid oxidase (DAO) inhibitors. Bioorg Med Chem Lett 18:3386-91 (2008)  
Target
Name:
D-amino-acid oxidase
Synonyms:
D-amino-acid oxidase (DAAO) DAMOX OXDA_HUMAN
Type:
Homodimer
Mol. Mass.:
39476.06
Organism:
Homo sapiens (Human)
Description:
P14920
Residue:
347
  
Inhibitor
Name:
BDBM50260769
Synonyms:
2-chloro-4H-furo[3,2-b]pyrrole-5-carboxylic acid | CHEMBL444199
Type:
Small organic molecule
Emp. Form.:
C7H4ClNO3
Mol. Mass.:
185.565
SMILES:
OC(=O)c1cc2oc(Cl)cc2[nH]1
: