Target
Cyclin-dependent kinase 2
Ligand
BDBM24631
Substrate
Meas. Tech.
ChEMBL_553548 (CHEMBL958731)
IC50
9100±n/a nM
Citation
 Congreve, MChessari, GTisi, DWoodhead, AJ Recent developments in fragment-based drug discovery. J Med Chem 51:3661-80 (2008)  
Target
Name:
Cyclin-dependent kinase 2
Synonyms:
CDK2 CDK2_HUMAN Cell division protein kinase 2 Protein cereblon/Cyclin-dependent kinase 2 | p33 protein kinase
Type:
Enzyme Subunit
Mol. Mass.:
33938.17
Organism:
Homo sapiens (Human)
Description:
P24941
Residue:
298
  
Inhibitor
Name:
BDBM24631
Synonyms:
4-[(6-chloropyrazin-2-yl)amino]benzene-1-sulfonamide CHEMBL487738
Type:
Small organic molecule
Emp. Form.:
C10H9ClN4O2S
Mol. Mass.:
284.722
SMILES:
NS(=O)(=O)c1ccc(Nc2cncc(Cl)n2)cc1
: