Target
Carbonic anhydrase 2
Ligand
BDBM50236140
Substrate
Meas. Tech.
ChEMBL_553540 (CHEMBL958723)
Kd
37±n/a nM
Citation
 Congreve, MChessari, GTisi, DWoodhead, AJ Recent developments in fragment-based drug discovery. J Med Chem 51:3661-80 (2008)  
Target
Name:
Carbonic anhydrase 2
Synonyms:
CA2 Carbonic anhydrase Carbonic anhydrase II Carbonic anhydrase II (CA-II)
Type:
Enzyme Catalytic Domain
Mol. Mass.:
29115.93
Organism:
Bos taurus
Description:
Residue:
260
  
Inhibitor
Name:
BDBM50236140
Synonyms:
4-ethynyl benzene sulfonamide CHEMBL272881
Type:
Small organic molecule
Emp. Form.:
C8H7NO2S
Mol. Mass.:
181.212
SMILES:
NS(=O)(=O)c1ccc(cc1)C#C
: