Target
Calmodulin-1
Ligand
BDBM50260600
Substrate
Meas. Tech.
ChEMBL_552364 (CHEMBL1005954)
Kd
18±n/a nM
Citation
 Kövesi, IMenyhárd, DKLaberge, MFidy, J Interaction of antagonists with calmodulin: insights from molecular dynamics simulations. J Med Chem 51:3081-93 (2008)  
Target
Name:
Calmodulin-1
Synonyms:
CALM CALM1_HUMAN CAM CAM2 Calmodulin-2
Type:
Protein
Mol. Mass.:
16813.73
Organism:
Human
Description:
P0DP23
Residue:
149
  
Inhibitor
Name:
BDBM50260600
Synonyms:
CHEMBL495235 N-(3,3-diphenylpropyl)-N'-[1-R-(3,4-bis-butoxyphenyl)-ethyl]-propylenediamine
Type:
Small organic molecule
Emp. Form.:
C34H48N2O2
Mol. Mass.:
516.7571
SMILES:
CCCCOc1ccc(cc1OCCCC)[C@@H](C)NCCCNCCC(c1ccccc1)c1ccccc1
: