Target
Lysophosphatidic acid receptor 3
Ligand
BDBM50271765
Substrate
Meas. Tech.
ChEMBL_556428 (CHEMBL955645)
IC50
1230±n/a nM
Citation
 Fells, JITsukahara, RFujiwara, YLiu, JPerygin, DHOsborne, DATigyi, GParrill, AL Identification of non-lipid LPA3 antagonists by virtual screening. Bioorg Med Chem 16:6207-17 (2008)  
Target
Name:
Lysophosphatidic acid receptor 3
Synonyms:
EDG7 LPAR3 Lysophosphatidic acid receptor 1/3 Lysophosphatidic acid receptor Edg-7
Type:
Enzyme
Mol. Mass.:
40149.72
Organism:
Homo sapiens (Human)
Description:
Q9UBY5
Residue:
353
  
Inhibitor
Name:
BDBM50271765
Synonyms:
3-(4-{3-[4-(3-Carboxy-acryloylamino)-phenoxy]-phenoxy}-phenylcarbamoyl)-acrylic acid CHEMBL482498
Type:
Small organic molecule
Emp. Form.:
C26H20N2O8
Mol. Mass.:
488.4456
SMILES:
OC(=O)\C=C\C(=O)Nc1ccc(Oc2cccc(Oc3ccc(NC(=O)\C=C\C(O)=O)cc3)c2)cc1
: