Target
Mu-type opioid receptor
Ligand
BDBM50139013
Substrate
Meas. Tech.
ChEMBL_556845 (CHEMBL964705)
IC50
9.67±n/a nM
Citation
 Wang, CLYao, JLYu, YShao, XCui, YLiu, HMLai, LHWang, R Structure-activity study of endomorphin-2 analogs with C-terminal modifications by NMR spectroscopy and molecular modeling. Bioorg Med Chem 16:6415-22 (2008)  
Target
Name:
Mu-type opioid receptor
Synonyms:
Mu-opioid receptor
Type:
PROTEIN
Mol. Mass.:
44729.40
Organism:
Cavia porcellus
Description:
ChEMBL_510437
Residue:
400
  
Inhibitor
Name:
BDBM50139013
Synonyms:
(S)-1-[(S)-2-Amino-3-(4-hydroxy-phenyl)-propionyl]-pyrrolidine-2-carboxylic acid [(S)-1-((S)-1-carbamoyl-2-phenyl-ethylcarbamoyl)-2-phenyl-ethyl]-amide 1-[(S)-2-Amino-3-(4-hydroxy-phenyl)-propionyl]-pyrrolidine-2-carboxylicacid[1-((S)-(S)-1-carbamoyl-2-phenyl-ethylcarbamoyl)-2-phenyl-ethyl]-amide H-Tyr-Pro-Phe-Phe-NH2 endomorphin-2
Type:
Small organic molecule
Emp. Form.:
C32H37N5O5
Mol. Mass.:
571.6667
SMILES:
N[C@@H](Cc1ccc(O)cc1)C(=O)N1CCC[C@H]1C(=O)N[C@@H](Cc1ccccc1)C(=O)N[C@@H](Cc1ccccc1)C(N)=O
: