Target
Sodium channel protein type 2 subunit alpha
Ligand
BDBM50270679
Substrate
Meas. Tech.
ChEMBL_552564 (CHEMBL954008)
IC50
350±n/a nM
Citation
 Drizin, IGregg, RJScanio, MJShi, LGross, MFAtkinson, RNThomas, JBJohnson, MSCarroll, WAMarron, BEChapman, MLLiu, DKrambis, MJShieh, CCZhang, XHernandez, GGauvin, DMMikusa, JPZhu, CZJoshi, SHonore, PMarsh, KCRoeloffs, RWerness, SKrafte, DSJarvis, MFFaltynek, CRKort, ME Discovery of potent furan piperazine sodium channel blockers for treatment of neuropathic pain. Bioorg Med Chem 16:6379-86 (2008)  
Target
Name:
Sodium channel protein type 2 subunit alpha
Synonyms:
HBSC II SCN2A SCN2A2 Sodium (Site 2) Sodium channel protein type 2 alpha subunit Voltage-gated sodium channel subunit alpha Nav1.2
Type:
Enzyme
Mol. Mass.:
227954.68
Organism:
Homo sapiens (Human)
Description:
Q99250
Residue:
2005
  
Inhibitor
Name:
BDBM50270679
Synonyms:
CHEMBL482676 | [5-(4-Chlorophenyl)furan-2-yl]-(4-cyclohexylpiperazin-1-yl)-methanone
Type:
Small organic molecule
Emp. Form.:
C21H25ClN2O2
Mol. Mass.:
372.888
SMILES:
Clc1ccc(cc1)-c1ccc(o1)C(=O)N1CCN(CC1)C1CCCCC1
: