Target
Nitric oxide synthase, brain
Ligand
BDBM50270533
Substrate
Meas. Tech.
ChEMBL_552617 (CHEMBL957261)
IC50
>500000±n/a nM
Citation
 Cottyn, BAcher, FRamassamy, BAlvey, LLepoivre, MFrapart, YStuehr, DMansuy, DBoucher, JLVichard, D Inhibitory effects of a series of 7-substituted-indazoles toward nitric oxide synthases: particular potency of 1H-indazole-7-carbonitrile. Bioorg Med Chem 16:5962-73 (2008)  
Target
Name:
Nitric oxide synthase, brain
Synonyms:
Bnos NC-NOS NOS type I nNOS Neuronal nitric oxide synthase Nitric Oxide Synthase, brain Nitric oxide synthase, brain (nNOS) Nitric-oxide synthase, brain (nNOS) Nos1 | Peptidyl-cysteine S-nitrosylase NOS1
Type:
Enzyme
Mol. Mass.:
160570.98
Organism:
Rattus norvegicus (rat)
Description:
Recombinant nNOS overexpressed in E. coli was used in enzyme assays.
Residue:
1429
  
Inhibitor
Name:
BDBM50270533
Synonyms:
3-Bromo-1-methyl-7-nitro-1H-indazole | CHEMBL504883
Type:
Small organic molecule
Emp. Form.:
C8H6BrN3O2
Mol. Mass.:
256.056
SMILES:
Cn1nc(Br)c2cccc([N+]([O-])=O)c12
: