Target
EEF1AKMT4-ECE2 readthrough transcript protein
Ligand
BDBM50001270
Substrate
Meas. Tech.
ChEMBL_552748 (CHEMBL965254)
IC50
6420±n/a nM
Citation
 Gagnidze, KSachchidanand, naRozenfeld, RMezei, MZhou, MMDevi, LA Homology modeling and site-directed mutagenesis to identify selective inhibitors of endothelin-converting enzyme-2. J Med Chem 51:3378-87 (2008)  
Target
Name:
EEF1AKMT4-ECE2 readthrough transcript protein
Synonyms:
EEF1AKMT4-ECE2 Endothelin-converting enzyme 2 Endothelin-converting enzyme 2 (ECE2) | Endothelin-converting enzyme 2 region
Type:
Enzyme
Mol. Mass.:
99745.05
Organism:
Homo sapiens (Human)
Description:
P0DPD8
Residue:
883
  
Inhibitor
Name:
BDBM50001270
Synonyms:
2-(2-(quinolin-2-yl)vinyl)phenol CHEMBL127545
Type:
Small organic molecule
Emp. Form.:
C17H13NO
Mol. Mass.:
247.2912
SMILES:
Oc1ccccc1\C=C\c1ccc2ccccc2n1
: