Target
Urotensin-2 receptor
Ligand
BDBM50240153
Substrate
Meas. Tech.
ChEMBL_555221 (CHEMBL965358)
Ki
16±n/a nM
Citation
 McAtee, JJDodson, JWDowdell, SEErhard, KGirard, GRGoodman, KBHilfiker, MAJin, JSehon, CASha, DShi, DWang, FWang, GZWang, NWang, YViet, AQYuan, CCZhang, DAiyar, NVBehm, DJCarballo, LHEvans, CAFries, HENagilla, RRoethke, TJXu, XDouglas, SANeeb, MJ Potent and selective small-molecule human urotensin-II antagonists with improved pharmacokinetic profiles. Bioorg Med Chem Lett 18:3716-9 (2008)  
Target
Name:
Urotensin-2 receptor
Synonyms:
G-protein coupled receptor 14 UR-II-R UTS2R Urotensin-II
Type:
Enzyme Catalytic Domain
Mol. Mass.:
42159.71
Organism:
Homo sapiens (Human)
Description:
Urotensin-II UTS2R HUMAN::Q9UKP6
Residue:
389
  
Inhibitor
Name:
BDBM50240153
Synonyms:
(+/-)-2-((3,4-dichlorophenyl)(methyl)amino)-1-(3-phenyl-2-(pyrrolidin-1-ylmethyl)piperidin-1-yl)ethanone rac-2-((3,4-dichlorophenyl)(methyl)amino)-1-(3-phenyl-2-(pyrrolidin-1-ylmethyl)piperidin-1-yl)ethanone
Type:
Small organic molecule
Emp. Form.:
C25H31Cl2N3O
Mol. Mass.:
460.439
SMILES:
CN(CC(=O)N1CCCC(C1CN1CCCC1)c1ccccc1)c1ccc(Cl)c(Cl)c1
: