Target
Cytochrome P450 2D6
Ligand
BDBM50244017
Substrate
Meas. Tech.
ChEMBL_555224 (CHEMBL965361)
IC50
33000±n/a nM
Citation
 McAtee, JJDodson, JWDowdell, SEErhard, KGirard, GRGoodman, KBHilfiker, MAJin, JSehon, CASha, DShi, DWang, FWang, GZWang, NWang, YViet, AQYuan, CCZhang, DAiyar, NVBehm, DJCarballo, LHEvans, CAFries, HENagilla, RRoethke, TJXu, XDouglas, SANeeb, MJ Potent and selective small-molecule human urotensin-II antagonists with improved pharmacokinetic profiles. Bioorg Med Chem Lett 18:3716-9 (2008)  
Target
Name:
Cytochrome P450 2D6
Synonyms:
CP2D6_HUMAN CYP2DL1 Cytochrome P450 2D6 (CYP2D6) P450-DB1
Type:
Protein
Mol. Mass.:
55774.82
Organism:
Homo sapiens (Human)
Description:
P10635
Residue:
497
  
Inhibitor
Name:
BDBM50244017
Synonyms:
CHEMBL452808 | N-((S)-1-Biphenyl-4-yl-2-morpholin-4-yl-ethyl)-2-(6,7-dichloro-3-oxo-2,3-dihydro-benzo[1,4]oxazin-4-yl)-N-methyl-acetamide
Type:
Small organic molecule
Emp. Form.:
C29H29Cl2N3O4
Mol. Mass.:
554.464
SMILES:
CN([C@H](CN1CCOCC1)c1ccc(cc1)-c1ccccc1)C(=O)CN1C(=O)COc2cc(Cl)c(Cl)cc12
: