Target
Cytochrome P450 3A4
Ligand
BDBM50243868
Substrate
Meas. Tech.
ChEMBL_555225 (CHEMBL965362)
IC50
3300±n/a nM
Citation
 McAtee, JJDodson, JWDowdell, SEErhard, KGirard, GRGoodman, KBHilfiker, MAJin, JSehon, CASha, DShi, DWang, FWang, GZWang, NWang, YViet, AQYuan, CCZhang, DAiyar, NVBehm, DJCarballo, LHEvans, CAFries, HENagilla, RRoethke, TJXu, XDouglas, SANeeb, MJ Potent and selective small-molecule human urotensin-II antagonists with improved pharmacokinetic profiles. Bioorg Med Chem Lett 18:3716-9 (2008)  
Target
Name:
Cytochrome P450 3A4
Synonyms:
Albendazole monooxygenase CP3A4_HUMAN CYP3A4 CYPIIIA4 Cytochrome P450 3A4 (CYP3A4) Nifedipine oxidase Taurochenodeoxycholate 6-alpha-hydroxylase
Type:
Enzyme
Mol. Mass.:
57349.57
Organism:
Homo sapiens (Human)
Description:
Residue:
503
  
Inhibitor
Name:
BDBM50243868
Synonyms:
(+/-)-2-((3,4-dichlorophenyl)(methyl)amino)-N-methyl-N-(1-phenyl-2-(pyrrolidin-1-yl)ethyl)acetamide | CHEMBL527199
Type:
Small organic molecule
Emp. Form.:
C22H27Cl2N3O
Mol. Mass.:
420.375
SMILES:
CN(CC(=O)N(C)C(CN1CCCC1)c1ccccc1)c1ccc(Cl)c(Cl)c1
: