Target
Aurora kinase B
Ligand
BDBM50243878
Substrate
Meas. Tech.
ChEMBL_554992 (CHEMBL962088)
IC50
2100±n/a nM
Citation
 Peifer, CSelig, RKinkel, KOtt, DTotzke, FSchächtele, CHeidenreich, RRöcken, MSchollmeyer, DLaufer, S Design, synthesis, and biological evaluation of novel 3-aryl-4-(1H-indole-3yl)-1,5-dihydro-2H-pyrrole-2-ones as vascular endothelial growth factor receptor (VEGF-R) inhibitors. J Med Chem 51:3814-24 (2008)  
Target
Name:
Aurora kinase B
Synonyms:
AIK2 AIM1 ARK2 AURKB_HUMAN Aurora B-INCENP Aurora kinase B (AURKB) STK-1 STK12 Serine/threonine-protein kinase aurora B
Type:
Protein
Mol. Mass.:
39327.72
Organism:
Homo sapiens (Human)
Description:
Q96GD4
Residue:
344
  
Inhibitor
Name:
BDBM50243878
Synonyms:
3-(1H-Indol-3-yl)-4-(3,4,5-trimethoxyphenyl)-1,5-dihydro-2Hpyrrole-2-one | CHEMBL521201
Type:
Small organic molecule
Emp. Form.:
C21H20N2O4
Mol. Mass.:
364.3945
SMILES:
COc1cc(cc(OC)c1OC)C1=C(C(=O)NC1)c1c[nH]c2ccccc12
: