Target
C-C chemokine receptor type 5
Ligand
BDBM50121838
Substrate
Meas. Tech.
ChEMBL_500129 (CHEMBL974332)
IC50
0.06±n/a nM
Citation
 Zhuo, YKong, RCong, XJChen, WZWang, CX Three-dimensional QSAR analyses of 1,3,4-trisubstituted pyrrolidine-based CCR5 receptor inhibitors. Eur J Med Chem 43:2724-34 (2008)  
Target
Name:
C-C chemokine receptor type 5
Synonyms:
C-C CKR-5 CC-CKR-5 CCR5 CCR5_HUMAN CHEMR13 HIV-1 fusion coreceptor
Type:
Enzyme
Mol. Mass.:
40540.21
Organism:
Homo sapiens (Human)
Description:
P51681
Residue:
352
  
Inhibitor
Name:
BDBM50121838
Synonyms:
(R)-3-cyclopropyl-2-((3S,4S)-3-((4-(3,3-difluoro-3-(4-fluorophenyl)propyl)piperidin-1-yl)methyl)-4-(3-fluorophenyl)pyrrolidin-1-yl)propanoic acid CHEMBL21106
Type:
Small organic molecule
Emp. Form.:
C31H38F4N2O2
Mol. Mass.:
546.6392
SMILES:
OC(=O)[C@@H](CC1CC1)N1C[C@H](CN2CCC(CCC(F)(F)c3ccc(F)cc3)CC2)[C@H](C1)c1cccc(F)c1
: