Target
Glucagon receptor
Ligand
BDBM50244237
Substrate
Meas. Tech.
ChEMBL_491826 (CHEMBL945216)
IC50
2±n/a nM
Citation
 Kim, RMChang, JLins, ARBrady, ECandelore, MRDallas-Yang, QDing, VDragovic, JIliff, SJiang, GMock, SQureshi, SSaperstein, RSzalkowski, DTamvakopoulos, CTota, LWright, MYang, XTata, JRChapman, KZhang, BBParmee, ER Discovery of potent, orally active benzimidazole glucagon receptor antagonists. Bioorg Med Chem Lett 18:3701-5 (2008)  
Target
Name:
Glucagon receptor
Synonyms:
GCGR GLR_HUMAN Glucagon receptor (GlucR)
Type:
Enzyme
Mol. Mass.:
54026.92
Organism:
Homo sapiens (Human)
Description:
P47871
Residue:
477
  
Inhibitor
Name:
BDBM50244237
Synonyms:
CHEMBL448921 | trans-4-(((4-tert-butylcyclohexyl)(5-(cyclopentylmethoxy)-1-methyl-1H-benzo[d]imidazol-2-yl)amino)methyl)-N-(1H-tetrazol-5-yl)benzamide
Type:
Small organic molecule
Emp. Form.:
C33H44N8O2
Mol. Mass.:
584.7549
SMILES:
Cn1c(nc2cc(OCC3CCCC3)ccc12)N(Cc1ccc(cc1)C(=O)Nc1nnn[nH]1)[C@H]1CC[C@@H](CC1)C(C)(C)C
: