Target
Galectin-3
Ligand
BDBM50243731
Substrate
Meas. Tech.
ChEMBL_491863 (CHEMBL946200)
Kd
550000±n/a nM
Citation
 Oberg, CTBlanchard, HLeffler, HNilsson, UJ Protein subtype-targeting through ligand epimerization: talose-selectivity of galectin-4 and galectin-8. Bioorg Med Chem Lett 18:3691-4 (2008)  
Target
Name:
Galectin-3
Synonyms:
LEG3_HUMAN MAC2
Type:
Enzyme
Mol. Mass.:
26156.54
Organism:
Homo sapiens (Human)
Description:
P17931
Residue:
250
  
Inhibitor
Name:
BDBM50243731
Synonyms:
(2R,3S,4S,5S,6R)-3-acetoxy-5-hydroxy-6-(hydroxymethyl)-2-methoxy-tetrahydro-2H-pyran-4-yl 4-methylbenzoate | CHEMBL471376
Type:
Small organic molecule
Emp. Form.:
C17H22O8
Mol. Mass.:
354.3518
SMILES:
CO[C@@H]1O[C@H](CO)[C@H](O)[C@H](OC(=O)c2ccc(C)cc2)[C@@H]1OC(C)=O
: