Target
Vitamin D3 receptor
Ligand
BDBM50244269
Substrate
Meas. Tech.
ChEMBL_491881 (CHEMBL946411)
EC50
4.5±n/a nM
Citation
 Shimizu, MMiyamoto, YTakaku, HMatsuo, MNakabayashi, MMasuno, HUdagawa, NDeLuca, HFIkura, TIto, N 2-Substituted-16-ene-22-thia-1alpha,25-dihydroxy-26,27-dimethyl-19-norvitamin D3 analogs: Synthesis, biological evaluation, and crystal structure. Bioorg Med Chem 16:6949-64 (2008)  
Target
Name:
Vitamin D3 receptor
Synonyms:
1,25-dihydroxyvitamin D3 receptor Nuclear receptor subfamily 1 group I member 1 Vdr Vitamin D3 receptor
Type:
PROTEIN
Mol. Mass.:
47830.18
Organism:
Mus musculus
Description:
ChEMBL_491881
Residue:
422
  
Inhibitor
Name:
BDBM50244269
Synonyms:
(20R)-1-alpha-2-alpha-25-Trihydroxy-2-beta-methyl-16-ene-22-thia-26,27-dimethyl-19,24-dinorvitamin D3 CHEMBL472321 | CHEMBL513573
Type:
Small organic molecule
Emp. Form.:
C27H44O4S
Mol. Mass.:
464.701
SMILES:
CCC(O)(CC)CS[C@H](C)C1=CC[C@H]2\C(CCC[C@]12C)=C\C=C1C[C@@H](O)C(C)(O)[C@H](O)C1
: