Target
Serine/threonine-protein kinase Chk1
Ligand
BDBM50243665
Substrate
Meas. Tech.
ChEMBL_491561 (CHEMBL944207)
IC50
980±n/a nM
Citation
 Janetka, JWAlmeida, LAshwell, SBrassil, PJDaly, KDeng, CGero, TGlynn, REHorn, CLIoannidis, SLyne, PNewcombe, NJOza, VBPass, MSpringer, SKSu, MToader, DVasbinder, MMYu, DYu, YZabludoff, SD Discovery of a novel class of 2-ureido thiophene carboxamide checkpoint kinase inhibitors. Bioorg Med Chem Lett 18:4242-8 (2008)  
Target
Name:
Serine/threonine-protein kinase Chk1
Synonyms:
CHEK1 CHK1 checkpoint homolog Checkpoint kinase-1 (CHK1)
Type:
Enzyme Catalytic Domain
Mol. Mass.:
54443.02
Organism:
Homo sapiens (Human)
Description:
gi_166295192
Residue:
476
  
Inhibitor
Name:
BDBM50243665
Synonyms:
(R)-1-(5-phenyl-3-(quinuclidin-8-ylcarbamoyl)thiophen-2-yl)urea | CHEMBL512706
Type:
Small organic molecule
Emp. Form.:
C19H22N4O2S
Mol. Mass.:
370.469
SMILES:
NC(=O)Nc1sc(cc1C(=O)N[C@H]1CN2CCC1CC2)-c1ccccc1
: