Target
Substance-P receptor
Ligand
BDBM50243425
Substrate
Meas. Tech.
ChEMBL_491574 (CHEMBL944220)
Ki
0.2±n/a nM
Citation
 Paliwal, SReichard, GAShah, SWrobleski, MLWang, CStengone, CTsui, HCXiao, DDuffy, RALachowicz, JENomeir, AAVarty, GBShih, NY Discovery of a novel, potent and orally active series of gamma-lactams as selective NK1 antagonists. Bioorg Med Chem Lett 18:4168-71 (2008)  
Target
Name:
Substance-P receptor
Synonyms:
NK-1 receptor NK1 Receptor NK1R_HUMAN Neurokinin-1 (NK-1) SPR TACR1 Tachykinin receptor 1 (NK1) | tachykinin
Type:
G Protein-Coupled Receptor (GPCR)
Mol. Mass.:
46254.43
Organism:
Homo sapiens (Human)
Description:
P25103
Residue:
407
  
Inhibitor
Name:
BDBM50243425
Synonyms:
1-((3S,5S)-5-(((R)-1-(3,5-bis(trifluoromethyl)phenyl)ethoxy)methyl)-2-oxo-5-phenylpyrrolidin-3-yl)pyrrolidin-2-one | CHEMBL453054
Type:
Small organic molecule
Emp. Form.:
C25H24F6N2O3
Mol. Mass.:
514.4601
SMILES:
C[C@@H](OC[C@]1(C[C@H](N2CCCC2=O)C(=O)N1)c1ccccc1)c1cc(cc(c1)C(F)(F)F)C(F)(F)F
: