Target
Dipeptidyl peptidase 8
Ligand
BDBM50243648
Substrate
Meas. Tech.
ChEMBL_492001 (CHEMBL938684)
IC50
72±n/a nM
Citation
 Van der Veken, PDe Meester, IDubois, VSoroka, AVan Goethem, SMaes, MBBrandt, ILambeir, AMChen, XHaemers, AScharpé, SAugustyns, K Inhibitors of dipeptidyl peptidase 8 and dipeptidyl peptidase 9. Part 1: identification of dipeptide derived leads. Bioorg Med Chem Lett 18:4154-8 (2008)  
Target
Name:
Dipeptidyl peptidase 8
Synonyms:
DPP8 DPRP-1 Dipeptidyl peptidase 8 (DPP-8) Dipeptidyl peptidase 8/9 Dipeptidyl peptidase VIII Prolyl dipeptidase DPP8
Type:
Enzyme
Mol. Mass.:
103342.62
Organism:
Homo sapiens (Human)
Description:
Q6V1X1
Residue:
898
  
Inhibitor
Name:
BDBM50243648
Synonyms:
(2S,4S)-1-((2S,3S)-2-amino-3-methylpentanoyl)-4-azidopyrrolidine-2-carbonitrile | CHEMBL471546
Type:
Small organic molecule
Emp. Form.:
C11H18N6O
Mol. Mass.:
250.3002
SMILES:
CC[C@H](C)[C@H](N)C(=O)N1C[C@H](C[C@H]1C#N)N=[N+]=[N-]
: