Target
Leucyl-cystinyl aminopeptidase
Ligand
BDBM50242871
Substrate
Meas. Tech.
ChEMBL_492334 (CHEMBL948330)
Ki
1000±n/a nM
Citation
 Andersson, HDemaegdt, HVauquelin, GLindeberg, GKarlén, AHallberg, M Ligands to the (IRAP)/AT4 receptor encompassing a 4-hydroxydiphenylmethane scaffold replacing Tyr2. Bioorg Med Chem 16:6924-35 (2008)  
Target
Name:
Leucyl-cystinyl aminopeptidase
Synonyms:
Aminopeptidase Cystinyl aminopeptidase Insulin-regulated membrane aminopeptidase LCAP_HUMAN Leucyl-cystinyl aminopeptidase, pregnancy serum form Oxytocinase Placental leucine aminopeptidase
Type:
PROTEIN
Mol. Mass.:
117334.10
Organism:
Homo sapiens (Human)
Description:
ChEMBL_1473494
Residue:
1025
  
Inhibitor
Name:
BDBM50242871
Synonyms:
2-(2-(((2S,3R)-2-(3-(4-hydroxybenzyl)-5-((S)-2-aminohexanamido)benzamido)-3-methylpentanamido)methyl)phenyl)acetic acid | CHEMBL355434
Type:
Small organic molecule
Emp. Form.:
C35H44N4O6
Mol. Mass.:
616.7471
SMILES:
CCCC[C@H](N)C(=O)Nc1cc(Cc2ccc(O)cc2)cc(c1)C(=O)N[C@@H]([C@H](C)CC)C(=O)NCc1ccccc1CC(O)=O
: