Target
Leucyl-cystinyl aminopeptidase
Ligand
BDBM50242861
Substrate
Meas. Tech.
ChEMBL_492335 (CHEMBL948331)
Ki
1200±n/a nM
Citation
 Andersson, HDemaegdt, HVauquelin, GLindeberg, GKarlén, AHallberg, M Ligands to the (IRAP)/AT4 receptor encompassing a 4-hydroxydiphenylmethane scaffold replacing Tyr2. Bioorg Med Chem 16:6924-35 (2008)  
Target
Name:
Leucyl-cystinyl aminopeptidase
Synonyms:
Aminopeptidase Cystinyl aminopeptidase Insulin-regulated membrane aminopeptidase LCAP_HUMAN Leucyl-cystinyl aminopeptidase, pregnancy serum form Oxytocinase Placental leucine aminopeptidase
Type:
PROTEIN
Mol. Mass.:
117334.10
Organism:
Homo sapiens (Human)
Description:
ChEMBL_1473494
Residue:
1025
  
Inhibitor
Name:
BDBM50242861
Synonyms:
(S)-2-((S)-1-((S)-2-((2S,3S)-2-(3-(4-hydroxybenzyl)-5-((S)-2-amino-3-methylbutanamido)benzamido)-3-methylpentanamido)-3-(1H-imidazol-5-yl)propanoyl)pyrrolidine-2-carboxamido)-3-phenylpropanoic acid | CHEMBL504736
Type:
Small organic molecule
Emp. Form.:
C45H56N8O8
Mol. Mass.:
836.9749
SMILES:
CC[C@H](C)[C@H](NC(=O)c1cc(Cc2ccc(O)cc2)cc(NC(=O)[C@@H](N)C(C)C)c1)C(=O)N[C@@H](Cc1cnc[nH]1)C(=O)N1CCC[C@H]1C(=O)N[C@@H](Cc1ccccc1)C(O)=O
: