Target
Tryptophan 5-hydroxylase 1
Ligand
BDBM50243618
Substrate
Meas. Tech.
ChEMBL_487488 (CHEMBL1016550)
IC50
24±n/a nM
Citation
 Shi, ZCDevasagayaraj, AGu, KJin, HMarinelli, BSamala, LScott, SStouch, TTunoori, AWang, YZang, YZhang, CKimball, SDMain, AJSun, WYang, QNouraldeen, AYu, XQBuxton, EPatel, SNguyen, NSwaffield, JPowell, DRWilson, ALiu, Q Modulation of peripheral serotonin levels by novel tryptophan hydroxylase inhibitors for the potential treatment of functional gastrointestinal disorders. J Med Chem 51:3684-7 (2008)  
Target
Name:
Tryptophan 5-hydroxylase 1
Synonyms:
TPH TPH1_HUMAN TRPH | Tryptophan 5-monooxygenase 1
Type:
PROTEIN
Mol. Mass.:
50990.64
Organism:
Homo sapiens (Human)
Description:
ChEMBL_1361824
Residue:
444
  
Inhibitor
Name:
BDBM50243618
Synonyms:
(2S)-2-amino-3-(4-(2-amino-6-(2,2,2-trifluoro-1-(2-(furan-2-yl)phenyl)ethoxy)pyrimidin-4-yl)phenyl)propanoic acid | CHEMBL471564
Type:
Small organic molecule
Emp. Form.:
C25H21F3N4O4
Mol. Mass.:
498.4538
SMILES:
N[C@@H](Cc1ccc(cc1)-c1cc(OC(c2ccccc2-c2ccco2)C(F)(F)F)nc(N)n1)C(O)=O
: