Target
Histone deacetylase 6
Ligand
BDBM50252371
Substrate
Meas. Tech.
ChEMBL_491722 (CHEMBL949577)
Ki
140±n/a nM
Citation
 Dehmel, FWeinbrenner, SJulius, HCiossek, TMaier, TStengel, TFettis, KBurkhardt, CWieland, HBeckers, T Trithiocarbonates as a novel class of HDAC inhibitors: SAR studies, isoenzyme selectivity, and pharmacological profiles. J Med Chem 51:3985-4001 (2008)  
Target
Name:
Histone deacetylase 6
Synonyms:
Cereblon/Histone deacetylase 6 HDAC6 Histone deacetylase 6 (HDAC6) KIAA0901 | ORF Names:JM21
Type:
Chromatin regulator; hydrolase; repressor
Mol. Mass.:
131381.51
Organism:
Homo sapiens (Human)
Description:
Q9UBN7
Residue:
1215
  
Inhibitor
Name:
BDBM50252371
Synonyms:
CHEMBL520279 | Ethyl 2-oxo-2-[1-(phenyl-sulfonyl)-1H-pyrrol-3-yl]-ethyl trithiocarbonate
Type:
Small organic molecule
Emp. Form.:
C15H15NO3S4
Mol. Mass.:
385.545
SMILES:
CCSC(=S)SCC(=O)c1ccn(c1)S(=O)(=O)c1ccccc1
: