Target
Neuronal acetylcholine receptor subunit alpha-4
Ligand
BDBM50251868
Substrate
Meas. Tech.
ChEMBL_492116 (CHEMBL947458)
IC50
860±n/a nM
Citation
 Tomizawa, MKagabu, SOhno, IDurkin, KACasida, JE Potency and selectivity of trifluoroacetylimino and pyrazinoylimino nicotinic insecticides and their fit at a unique binding site niche. J Med Chem 51:4213-8 (2008)  
Target
Name:
Neuronal acetylcholine receptor subunit alpha-4
Synonyms:
ACHA4_CHICK | CHRNA4
Type:
PROTEIN
Mol. Mass.:
70849.36
Organism:
Gallus gallus
Description:
ChEMBL_492116
Residue:
622
  
Inhibitor
Name:
BDBM50251868
Synonyms:
(Z)-thiacloprid {(2Z)-3-[(6-chloropyridin-3-yl)methyl]-1,3-thiazolidin-2-ylidene}cyanamide
Type:
Small organic molecule
Emp. Form.:
C10H9ClN4S
Mol. Mass.:
252.723
SMILES:
Clc1ccc(CN2CCS\C2=N/C#N)cn1
: