Target
Cannabinoid receptor 1
Ligand
BDBM50200841
Substrate
Meas. Tech.
ChEMBL_490321 (CHEMBL981115)
IC50
0.29±n/a nM
Citation
 Hagmann, WK The many roles for fluorine in medicinal chemistry. J Med Chem 51:4359-69 (2008)  
Target
Name:
Cannabinoid receptor 1
Synonyms:
CANN6 CB-R CNR CNR1_HUMAN Cannabinoid receptor Cannabinoid receptor 1 (brain)
Type:
G Protein-Coupled Receptor (GPCR)
Mol. Mass.:
52868.96
Organism:
Homo sapiens (Human)
Description:
P21554
Residue:
472
  
Inhibitor
Name:
BDBM50200841
Synonyms:
CHEMBL220360 MK-0634 N-[(1S,2S)-3-(4-chlorophenyl)-2-(3-cyanophenyl)-1-methylpropyl]-2-methyl-2-{[5-(trifluoromethyl)pyridin-2-yl]oxy}propanamide Taranbant
Type:
Small organic molecule
Emp. Form.:
C27H25ClF3N3O2
Mol. Mass.:
515.955
SMILES:
C[C@H](NC(=O)C(C)(C)Oc1ccc(cn1)C(F)(F)F)[C@@H](Cc1ccc(Cl)cc1)c1cccc(c1)C#N
: