Target
Insulin-like growth factor 1 receptor
Ligand
BDBM50252194
Substrate
Meas. Tech.
ChEMBL_487711 (CHEMBL1022736)
IC50
108±n/a nM
Citation
 Zimmermann, KWittman, MDSaulnier, MGVelaparthi, ULangley, DRSang, XFrennesson, DCarboni, JLi, AGreer, AGottardis, MAttar, RMYang, ZBalimane, PDiscenza, LNVyas, D Balancing oral exposure with Cyp3A4 inhibition in benzimidazole-based IGF-IR inhibitors. Bioorg Med Chem Lett 18:4075-80 (2008)  
Target
Name:
Insulin-like growth factor 1 receptor
Synonyms:
IGF1R_MOUSE | Igf1r
Type:
PROTEIN
Mol. Mass.:
155770.40
Organism:
Mus musculus
Description:
ChEMBL_820934
Residue:
1373
  
Inhibitor
Name:
BDBM50252194
Synonyms:
(S)-4-(2-(3-chlorophenyl)-2-hydroxyethylamino)-3-(4-methyl-6-(4-(methylamino)piperidin-1-yl)-1H-benzo[d]imidazol-2-yl)pyridin-2(1H)-one | CHEMBL482102
Type:
Small organic molecule
Emp. Form.:
C27H31ClN6O2
Mol. Mass.:
507.027
SMILES:
CNC1CCN(CC1)c1cc(C)c2nc([nH]c2c1)-c1c(NC[C@@H](O)c2cccc(Cl)c2)cc[nH]c1=O
: