Target
Urotensin-2 receptor
Ligand
BDBM50252659
Substrate
Meas. Tech.
ChEMBL_487749 (CHEMBL1009481)
Ki
4±n/a nM
Citation
 Jin, JAn, MSapienza, AAiyar, NNaselsky, DSarau, HMFoley, JJSalyers, KLKnight, SDKeenan, RMRivero, RADhanak, DDouglas, SA Urotensin-II receptor antagonists: synthesis and SAR of N-cyclic azaalkyl benzamides. Bioorg Med Chem Lett 18:3950-4 (2008)  
Target
Name:
Urotensin-2 receptor
Synonyms:
G-protein coupled receptor 14 UR-II-R UTS2R Urotensin-II
Type:
Enzyme Catalytic Domain
Mol. Mass.:
42159.71
Organism:
Homo sapiens (Human)
Description:
Urotensin-II UTS2R HUMAN::Q9UKP6
Residue:
389
  
Inhibitor
Name:
BDBM50252659
Synonyms:
(S)-N-(1-(3-bromo-4-(piperidin-4-yloxy)benzyl)pyrrolidin-3-yl)-3,4-dichlorobenzamide | CHEMBL495075
Type:
Small organic molecule
Emp. Form.:
C23H26BrCl2N3O2
Mol. Mass.:
527.281
SMILES:
Clc1ccc(cc1Cl)C(=O)N[C@H]1CCN(Cc2ccc(OC3CCNCC3)c(Br)c2)C1
: