Target
Potassium voltage-gated channel subfamily H member 2
Ligand
BDBM50251950
Substrate
Meas. Tech.
ChEMBL_487847 (CHEMBL1020033)
IC50
1200±n/a nM
Citation
 Cox, CDColeman, PJBreslin, MJWhitman, DBGarbaccio, RMFraley, MEBuser, CAWalsh, ESHamilton, KSchaber, MDLobell, RBTao, WDavide, JPDiehl, REAbrams, MTSouth, VJHuber, HETorrent, MPrueksaritanont, TLi, CSlaughter, DEMahan, EFernandez-Metzler, CYan, YKuo, LCKohl, NEHartman, GD Kinesin spindle protein (KSP) inhibitors. 9. Discovery of (2S)-4-(2,5-difluorophenyl)-n-[(3R,4S)-3-fluoro-1-methylpiperidin-4-yl]-2-(hydroxymethyl)-N-methyl-2-phenyl-2,5-dihydro-1H-pyrrole-1-carboxamide (MK-0731) for the treatment of taxane-refractory cancer. J Med Chem 51:4239-52 (2008)  
Target
Name:
Potassium voltage-gated channel subfamily H member 2
Synonyms:
1,3-beta-glucan synthase component GLS2 ERG Eag-related protein 1 Ether-a-go-go-related gene (HERG) Ether-a-go-go-related gene potassium channel 1 Ether-a-go-go-related gene potassium channel 1 (hERG1) Ether-a-go-go-related protein 1 H-ERG KCNH2 Potassium voltage-gated channel subfamily H member 2 (hERG) Voltage-gated potassium channel subunit Kv11.1 hERG Potassium Channel 1 | putative potassium channel subunit
Type:
Multi-pass membrane protein
Mol. Mass.:
126672.65
Organism:
Homo sapiens (Human)
Description:
Q12809
Residue:
1159
  
Inhibitor
Name:
BDBM50251950
Synonyms:
(S)-4-(2,5-difluorophenyl)-N-methyl-N-(1-methylpiperidin-4-yl)-2-phenyl-2H-pyrrole-1(5H)-carboxamide | CHEMBL481959
Type:
Small organic molecule
Emp. Form.:
C24H27F2N3O
Mol. Mass.:
411.4875
SMILES:
CN(C1CCN(C)CC1)C(=O)N1CC(=C[C@H]1c1ccccc1)c1cc(F)ccc1F
: