Target
11-beta-hydroxysteroid dehydrogenase 1
Ligand
BDBM50252315
Substrate
Meas. Tech.
ChEMBL_487967 (CHEMBL1013098)
IC50
10±n/a nM
Citation
 Xiang, JWan, ZKLi, HQIpek, MBinnun, ENunez, JChen, LMcKew, JCMansour, TSXu, XSuri, VTam, MXing, YLi, XHahm, STobin, JSaiah, E Piperazine sulfonamides as potent, selective, and orally available 11beta-hydroxysteroid dehydrogenase type 1 inhibitors with efficacy in the rat cortisone-induced hyperinsulinemia model. J Med Chem 51:4068-71 (2008)  
Target
Name:
11-beta-hydroxysteroid dehydrogenase 1
Synonyms:
11-DH 11-beta-Hydroxysteroid Dehydrogenase 1 (11-beta-HSD1) 11-beta-hydroxysteroid dehydrogenase 1 (11HSD1) Corticosteroid 11-beta-dehydrogenase isozyme 1 (11-beta-HSD-1) Corticosteroid 11-beta-dehydrogenase isozyme 1 (11beta-HSD1) HSD11 HSD11L | SDR26C1
Type:
Enzyme
Mol. Mass.:
32409.16
Organism:
Homo sapiens (Human)
Description:
P28845
Residue:
292
  
Inhibitor
Name:
BDBM50252315
Synonyms:
(3R)-1-[3-({(2R)-4-[4-fluoro-2-(trifluoromethyl)phenyl]-2-methylpiperazin-1-yl}sulfonyl)phenyl]pyrrolidin-3-ol | CHEMBL479412
Type:
Small organic molecule
Emp. Form.:
C22H25F4N3O3S
Mol. Mass.:
487.511
SMILES:
C[C@@H]1CN(CCN1S(=O)(=O)c1cccc(c1)N1CC[C@@H](O)C1)c1ccc(F)cc1C(F)(F)F
: