Target
Receptor-type tyrosine-protein phosphatase F
Ligand
BDBM50149232
Substrate
Meas. Tech.
ChEMBL_490538 (CHEMBL981144)
Ki
1300±n/a nM
Citation
 Ling, QHuang, YZhou, YCai, ZXiong, BZhang, YMa, LWang, XLi, XLi, JShen, J Illudalic acid as a potential LAR inhibitor: synthesis, SAR, and preliminary studies on the mechanism of action. Bioorg Med Chem 16:7399-409 (2008)  
Target
Name:
Receptor-type tyrosine-protein phosphatase F
Synonyms:
LAR Leukocyte common antigen related (LAR) PTPRF_HUMAN Receptor-type tyrosine-protein phosphatase F (LAR)
Type:
Protein
Mol. Mass.:
212869.85
Organism:
Homo sapiens (Human)
Description:
P10586
Residue:
1907
  
Inhibitor
Name:
BDBM50149232
Synonyms:
3-(5-(2-acetamido-3-(4-(carboxy-N-(2-carboxyphenyl)formamido))naphthalen-1-yl)propanamido)pentyloxy)-2-naphthoic acid CHEMBL324968
Type:
Small organic molecule
Emp. Form.:
C40H37N3O10
Mol. Mass.:
719.7359
SMILES:
CC(=O)NC(Cc1ccc(N(C(=O)C(O)=O)c2ccccc2C(O)=O)c2ccccc12)C(=O)NCCCCCOc1cc2ccccc2cc1C(O)=O
: