Target
Receptor-type tyrosine-protein phosphatase F
Ligand
BDBM50262987
Substrate
Meas. Tech.
ChEMBL_490539 (CHEMBL981145)
IC50
1300±n/a nM
Citation
 Ling, QHuang, YZhou, YCai, ZXiong, BZhang, YMa, LWang, XLi, XLi, JShen, J Illudalic acid as a potential LAR inhibitor: synthesis, SAR, and preliminary studies on the mechanism of action. Bioorg Med Chem 16:7399-409 (2008)  
Target
Name:
Receptor-type tyrosine-protein phosphatase F
Synonyms:
LAR Leukocyte common antigen related (LAR) PTPRF_HUMAN Receptor-type tyrosine-protein phosphatase F (LAR)
Type:
Protein
Mol. Mass.:
212869.85
Organism:
Homo sapiens (Human)
Description:
P10586
Residue:
1907
  
Inhibitor
Name:
BDBM50262987
Synonyms:
CHEMBL506661 | Illudalic acid
Type:
Small organic molecule
Emp. Form.:
C15H16O5
Mol. Mass.:
276.2845
SMILES:
CC1(C)Cc2c(C1)c1C(=O)OC(O)Cc1c(C=O)c2O
: