Target
Inosine-5'-monophosphate dehydrogenase 1
Ligand
BDBM19267
Substrate
Meas. Tech.
ChEMBL_490551 (CHEMBL981157)
Ki
20±n/a nM
Citation
 Chen, LPetrelli, ROlesiak, MWilson, DJLabello, NPPankiewicz, KW Bis(sulfonamide) isosters of mycophenolic adenine dinucleotide analogues: inhibition of inosine monophosphate dehydrogenase. Bioorg Med Chem 16:7462-9 (2008)  
Target
Name:
Inosine-5'-monophosphate dehydrogenase 1
Synonyms:
IMDH1_HUMAN IMPD 1 IMPDH-I Inosine Monophosphate Dehydrogenase Type 1 (IMPDH1) | Inosine-5'-monophosphate dehydrogenase (IMPDH)
Type:
Enzyme
Mol. Mass.:
55407.70
Organism:
Homo sapiens (Human)
Description:
Recombinant IMPDH1 expressed in E. coli.
Residue:
514
  
Inhibitor
Name:
BDBM19267
Synonyms:
CHEMBL392204 [({[(2R,3S,4R,5R)-5-(6-amino-2-ethyl-9H-purin-9-yl)-3,4-dihydroxyoxolan-2-yl]methoxy}(hydroxy)phosphoryl)methyl][2-(4-hydroxy-6-methoxy-7-methyl-3-oxo-1,3-dihydro-2-benzofuran-5-yl)ethoxy]phosphinic acid
Type:
Small organic molecule
Emp. Form.:
C25H33N5O13P2
Mol. Mass.:
673.5027
SMILES:
CCc1nc(N)c2ncn([C@@H]3O[C@H](COP(O)(=O)CP(O)(=O)OCCc4c(O)c5C(=O)OCc5c(C)c4OC)[C@@H](O)[C@H]3O)c2n1
: