Target
Voltage-dependent T-type calcium channel subunit alpha-1G
Ligand
BDBM50222222
Substrate
Meas. Tech.
ChEMBL_488356 (CHEMBL984789)
IC50
41±n/a nM
Citation
 Heo, JHSeo, HNChoe, YJKim, SOh, CRKim, YDRhim, HChoo, DJKim, JLee, JY T-type Ca2+ channel blockers suppress the growth of human cancer cells. Bioorg Med Chem Lett 18:3899-901 (2008)  
Target
Name:
Voltage-dependent T-type calcium channel subunit alpha-1G
Synonyms:
CAC1G_HUMAN KIAA1123 Voltage-gated T-type calcium channel alpha-1G subunit
Type:
PROTEIN
Mol. Mass.:
262471.14
Organism:
Homo sapiens (Human)
Description:
ChEMBL_1515216
Residue:
2377
  
Inhibitor
Name:
BDBM50222222
Synonyms:
CHEMBL394956 N-benzyl-2-(3-(biphenyl-4-yl)-2-((5-(dimethylamino)pentyl)(methyl)amino)-3,4-dihydroquinazolin-4-yl)acetamide | N-benzyl-2-{3-biphenyl-4-yl-2-[(5-dimethylamino-pentyl)-methyl-amino]-3,4-dihydro-quinazolin-4-yl}-acetamide
Type:
Small organic molecule
Emp. Form.:
C37H43N5O
Mol. Mass.:
573.7702
SMILES:
CN(C)CCCCCN(C)C1=Nc2ccccc2C(CC(=O)NCc2ccccc2)N1c1ccc(cc1)-c1ccccc1
: