Target
Poly [ADP-ribose] polymerase 1
Ligand
BDBM50251695
Substrate
Meas. Tech.
ChEMBL_488104 (CHEMBL986586)
Ki
15±n/a nM
Citation
 Zhu, GDGandhi, VBGong, JThomas, SLuo, YLiu, XShi, YKlinghofer, VJohnson, EFFrost, DDonawho, CJarvis, KBouska, JMarsh, KCRosenberg, SHGiranda, VLPenning, TD Synthesis and SAR of novel, potent and orally bioavailable benzimidazole inhibitors of poly(ADP-ribose) polymerase (PARP) with a quaternary methylene-amino substituent. Bioorg Med Chem Lett 18:3955-8 (2008)  
Target
Name:
Poly [ADP-ribose] polymerase 1
Synonyms:
(ARTD1 or PARP1) 2.4.2.30 ADPRT ARTD1 Human diphtheria toxin-like ADP-ribosyltransferase (ARTD1 or PARP1) NT-PARP-1 PARP1 PPOL Poly [ADP-ribose] polymerase 1 (PARP) Poly [ADP-ribose] polymerase 1 (PARP1) Poly [ADP-ribose] polymerase 1, 28-kDa form Poly [ADP-ribose] polymerase 1, processed C-terminus Poly [ADP-ribose] polymerase-1 Poly(ADP-ribose) polymerase-1 (ARTD1/PARP1) Protein poly-ADP-ribosyltransferase PARP1 | Synonyms=ADPRT
Type:
Mol. Mass.:
113114.22
Organism:
Homo sapiens (Human)
Description:
P09874
Residue:
1014
  
Inhibitor
Name:
BDBM50251695
Synonyms:
2-(2-(piperidin-1-yl)propan-2-yl)-1H-benzo[d]imidazole-4-carboxamide | CHEMBL479937
Type:
Small organic molecule
Emp. Form.:
C16H22N4O
Mol. Mass.:
286.3721
SMILES:
CC(C)(N1CCCCC1)c1nc2cccc(C(N)=O)c2[nH]1
: