Target
C5a anaphylatoxin chemotactic receptor 1
Ligand
BDBM50251713
Substrate
Meas. Tech.
ChEMBL_488511 (CHEMBL991044)
IC50
430±n/a nM
Citation
 Gong, YBarbay, JKBuntinx, MLi, JWauwe, JVClaes, CLommen, GVHornby, PJHe, W Design and optimization of aniline-substituted tetrahydroquinoline C5a receptor antagonists. Bioorg Med Chem Lett 18:3852-5 (2008)  
Target
Name:
C5a anaphylatoxin chemotactic receptor 1
Synonyms:
C5AR C5AR1_HUMAN C5a anaphylatoxin chemotactic receptor C5a-R | CD_antigen=CD88
Type:
Enzyme
Mol. Mass.:
39347.68
Organism:
Homo sapiens (Human)
Description:
P21730
Residue:
350
  
Inhibitor
Name:
BDBM50251713
Synonyms:
2-(2,6-diethylphenyl)-N-(2,5-dimethylphenyl)-4-methoxy-5,6,7,8-tetrahydroquinolin-5-amine | CHEMBL517683
Type:
Small organic molecule
Emp. Form.:
C28H34N2O
Mol. Mass.:
414.5824
SMILES:
CCc1cccc(CC)c1-c1cc(OC)c2C(CCCc2n1)Nc1cc(C)ccc1C
: