Target
C5a anaphylatoxin chemotactic receptor 1
Ligand
BDBM50251847
Substrate
Meas. Tech.
ChEMBL_488511 (CHEMBL991044)
IC50
120±n/a nM
Citation
 Gong, YBarbay, JKBuntinx, MLi, JWauwe, JVClaes, CLommen, GVHornby, PJHe, W Design and optimization of aniline-substituted tetrahydroquinoline C5a receptor antagonists. Bioorg Med Chem Lett 18:3852-5 (2008)  
Target
Name:
C5a anaphylatoxin chemotactic receptor 1
Synonyms:
C5AR C5AR1_HUMAN C5a anaphylatoxin chemotactic receptor C5a-R | CD_antigen=CD88
Type:
Enzyme
Mol. Mass.:
39347.68
Organism:
Homo sapiens (Human)
Description:
P21730
Residue:
350
  
Inhibitor
Name:
BDBM50251847
Synonyms:
(2-(2-(2,6-diethylphenyl)-4-methoxy-5,6,7,8-tetrahydroquinolin-5-ylamino)phenyl)methanol | CHEMBL481756
Type:
Small organic molecule
Emp. Form.:
C27H32N2O2
Mol. Mass.:
416.5552
SMILES:
CCc1cccc(CC)c1-c1cc(OC)c2C(CCCc2n1)Nc1ccccc1CO
: