Target
5-hydroxytryptamine receptor 1A
Ligand
BDBM50155520
Substrate
Meas. Tech.
ChEMBL_490812 (CHEMBL992749)
Ki
90.9±n/a nM
Citation
 Ablordeppey, SYAltundas, RBricker, BZhu, XYKumar, EVJackson, TKhan, ARoth, BL Identification of a butyrophenone analog as a potential atypical antipsychotic agent: 4-[4-(4-chlorophenyl)-1,4-diazepan-1-yl]-1-(4-fluorophenyl)butan-1-one. Bioorg Med Chem 16:7291-301 (2008)  
Target
Name:
5-hydroxytryptamine receptor 1A
Synonyms:
5-HT-1A 5-hydroxytryptamine receptor 1A (5-HT-1A) ADRB2RL1 Dopamine D2 receptor and serotonin 1a receptor HTR1A | Serotonin receptor 1A
Type:
Mol. Mass.:
46122.49
Organism:
Homo sapiens (Human)
Description:
Residue:
422
  
Inhibitor
Name:
BDBM50155520
Synonyms:
4-[4-(4-Chloro-phenyl)-piperazin-1-yl]-1-(4-fluoro-phenyl)-butan-1-one; hydrochloride CHEMBL558392
Type:
Small organic molecule
Emp. Form.:
C20H22ClFN2O
Mol. Mass.:
360.853
SMILES:
Fc1ccc(cc1)C(=O)CCCN1CCN(CC1)c1ccc(Cl)cc1
: