Target
D(2) dopamine receptor
Ligand
BDBM50262930
Substrate
Meas. Tech.
ChEMBL_490806 (CHEMBL992743)
Ki
178.4±n/a nM
Citation
 Ablordeppey, SYAltundas, RBricker, BZhu, XYKumar, EVJackson, TKhan, ARoth, BL Identification of a butyrophenone analog as a potential atypical antipsychotic agent: 4-[4-(4-chlorophenyl)-1,4-diazepan-1-yl]-1-(4-fluorophenyl)butan-1-one. Bioorg Med Chem 16:7291-301 (2008)  
Target
Name:
D(2) dopamine receptor
Synonyms:
D(2) dopamine receptor DOPAMINE D2 Long DRD2 Dopamine D2 receptor Dopamine D2 receptor (D2R) Dopamine2-like | d2
Type:
Cell-surface receptors
Mol. Mass.:
50647.10
Organism:
Homo sapiens (Human)
Description:
P14416
Residue:
443
  
Inhibitor
Name:
BDBM50262930
Synonyms:
4-(3-(4-chlorophenyl)-3,9-diazabicyclo[4.2.1]nonan-9-yl)-1-(4-fluorophenyl)butan-1-one CHEMBL476109
Type:
Small organic molecule
Emp. Form.:
C23H26ClFN2O
Mol. Mass.:
400.917
SMILES:
Fc1ccc(cc1)C(=O)CCCN1C2CCC1CN(CC2)c1ccc(Cl)cc1
: