Target
D(3) dopamine receptor
Ligand
BDBM50251613
Substrate
Meas. Tech.
ChEMBL_488688 (CHEMBL988378)
IC50
>10000±n/a nM
Citation
 Park, CMKim, SYPark, WKPark, NSSeong, CM Synthesis and structure-activity relationship of 1H-indole-3-carboxylic acid pyridine-3-ylamides: a novel series of 5-HT2C receptor antagonists. Bioorg Med Chem Lett 18:3844-7 (2008)  
Target
Name:
D(3) dopamine receptor
Synonyms:
DOPAMINE D3 DRD3_HUMAN Dopamine D3 receptor (D3) Dopamine receptor Dopamine receptor D3
Type:
Mol. Mass.:
44243.43
Organism:
Homo sapiens (Human)
Description:
Residue:
400
  
Inhibitor
Name:
BDBM50251613
Synonyms:
6-methyl-N-(6-(2-methylpyridin-3-yloxy)pyridin-3-yl)-1H-indole-3-carboxamide | CHEMBL519103
Type:
Small organic molecule
Emp. Form.:
C21H18N4O2
Mol. Mass.:
358.3932
SMILES:
Cc1ccc2c(c[nH]c2c1)C(=O)Nc1ccc(Oc2cccnc2C)nc1
: