Target
5-hydroxytryptamine receptor 6
Ligand
BDBM50251648
Substrate
Meas. Tech.
ChEMBL_488685 (CHEMBL988375)
IC50
>10000±n/a nM
Citation
 Park, CMKim, SYPark, WKPark, NSSeong, CM Synthesis and structure-activity relationship of 1H-indole-3-carboxylic acid pyridine-3-ylamides: a novel series of 5-HT2C receptor antagonists. Bioorg Med Chem Lett 18:3844-7 (2008)  
Target
Name:
5-hydroxytryptamine receptor 6
Synonyms:
5-HT-6 5-hydroxytryptamine receptor 6 (5-HT-6) 5-hydroxytryptamine receptor 6 (5HT6) HTR6 Serotonin 6 (5-HT6) receptor | Serotonin Receptor 6
Type:
G Protein-Coupled Receptor (GPCR)
Mol. Mass.:
46968.43
Organism:
Homo sapiens (Human)
Description:
P50406
Residue:
440
  
Inhibitor
Name:
BDBM50251648
Synonyms:
CHEMBL479952 | N-(6-(pyridin-3-yloxy)pyridin-3-yl)-1H-indole-3-carboxamide
Type:
Small organic molecule
Emp. Form.:
C19H14N4O2
Mol. Mass.:
330.3401
SMILES:
O=C(Nc1ccc(Oc2cccnc2)nc1)c1c[nH]c2ccccc12
: