Target
Mitogen-activated protein kinase 14
Ligand
BDBM50263169
Substrate
Meas. Tech.
ChEMBL_489078 (CHEMBL987298)
Ki
15±n/a nM
Citation
 Angell, RMAngell, TDBamborough, PBamford, MJChung, CWCockerill, SGFlack, SSJones, KLLaine, DILongstaff, TLudbrook, SPearson, RSmith, KJSmee, PASomers, DOWalker, AL Biphenyl amide p38 kinase inhibitors 4: DFG-in and DFG-out binding modes. Bioorg Med Chem Lett 18:4433-7 (2008)  
Target
Name:
Mitogen-activated protein kinase 14
Synonyms:
CSAID-binding protein CSBP1 CSPB1 MAP kinase 14 MAP kinase p38 alpha MAPK14 MK14_HUMAN Mitogen-activated protein kinase p38 alpha Stress-activated protein kinase 2a | p38 MAP kinase alpha/beta
Type:
Serine/threonine-protein kinase
Mol. Mass.:
41286.76
Organism:
Homo sapiens (Human)
Description:
Q16539
Residue:
360
  
Inhibitor
Name:
BDBM50263169
Synonyms:
4-Methyl-3,4,5,6-tetrahydro-2H-[1,2']bipyridinyl-4'-carboxylic acid [4'-(cyclopropylmethyl-carbamoyl)-6-methyl-biphenyl-3-yl]-amide | CHEMBL514207
Type:
Small organic molecule
Emp. Form.:
C30H34N4O2
Mol. Mass.:
482.6166
SMILES:
CC1CCN(CC1)c1cc(ccn1)C(=O)Nc1ccc(C)c(c1)-c1ccc(cc1)C(=O)NCC1CC1
: